Target
Heat shock protein HSP 90-alpha
Ligand
BDBM50343386
Substrate
Meas. Tech.
ChEMBL_746939 (CHEMBL1777305)
Ki
9±n/a nM
Citation
 Zehnder, LBennett, MMeng, JHuang, BNinkovic, SWang, FBraganza, JTatlock, JJewell, TZhou, JZBurke, BWang, JMaegley, KMehta, PPYin, MJGajiwala, KSHickey, MJYamazaki, SSmith, EKang, PSistla, ADovalsantos, EGehring, MRKania, RWythes, MKung, PP Optimization of potent, selective, and orally bioavailable pyrrolodinopyrimidine-containing inhibitors of heat shock protein 90. Identification of development candidate 2-amino-4-{4-chloro-2-[2-(4-fluoro-1H-pyrazol-1-yl)ethoxy]-6-methylphenyl}-N-(2,2-difluoropropyl)-5,7-dihydro-6H-pyrrolo[3,4-d]pyr J Med Chem 54:3368-85 (2011)  
Target
Name:
Heat shock protein HSP 90-alpha
Synonyms:
HS90A_HUMAN HSP86 HSP90AA1 HSPCA Heat shock 86 kDa Heat shock protein HSP 90-alpha (HSP90) LAP-2 Lipopolysaccharide-associated protein 2 heat shock protein 90kDa alpha (cytosolic), class A member 1 isoform 2
Type:
Molecular Chaperone
Mol. Mass.:
84623.45
Organism:
Homo sapiens (Human)
Description:
P07900
Residue:
732
  
Inhibitor
Name:
BDBM50343386
Synonyms:
2-Amino-4-[2,4-dichloro-6-(2-pyrazol-1-ylethoxy)phenyl]-5,7-dihydropyrrolo[3,4-d]pyrimidine-6-carboxylic Acid(2,2-Difluoroethyl)amide | CHEMBL1774925
Type:
Small organic molecule
Emp. Form.:
C20H19Cl2F2N7O2
Mol. Mass.:
498.313
SMILES:
Nc1nc2CN(Cc2c(n1)-c1c(Cl)cc(Cl)cc1OCCn1cccn1)C(=O)NCC(F)F
: