Target
Cytochrome P450 11B1, mitochondrial
Ligand
BDBM50125935
Substrate
Meas. Tech.
ChEMBL_809500 (CHEMBL2015355)
IC50
0.5±n/a nM
Citation
 Hille, UEZimmer, CHaupenthal, JHartmann, RW Optimization of the First Selective Steroid-11ß-hydroxylase (CYP11B1) Inhibitors for the Treatment of Cortisol Dependent Diseases. ACS Med Chem Lett 2:559-564 (2011)  
Target
Name:
Cytochrome P450 11B1, mitochondrial
Synonyms:
C11B1_HUMAN CYPXIB1 Cytochrome P450 11B1 Cytochrome P450 11B1, mitochondrial | S11BH
Type:
Enzyme
Mol. Mass.:
57591.44
Organism:
Homo sapiens (Human)
Description:
P15538
Residue:
503
  
Inhibitor
Name:
BDBM50125935
Synonyms:
(R)-1-(1-phenylethyl)-1H-imidazole-5-carboxylic acid ethyl ester 3-((R)-1-Phenyl-ethyl)-3H-imidazole-4-carboxylic acid ethyl ester CHEMBL681 R(+)-etomidate | R-ETOMIDATE
Type:
Small organic molecule
Emp. Form.:
C14H16N2O2
Mol. Mass.:
244.289
SMILES:
CCOC(=O)c1cncn1[C@H](C)c1ccccc1
: