Target
DNA polymerase lambda
Ligand
BDBM50379294
Substrate
Meas. Tech.
ChEMBL_811411 (CHEMBL2013669)
IC50
>200000±n/a nM
Citation
 Myobatake, YTakeuchi, TKuramochi, KKuriyama, IIshido, THirano, KSugawara, FYoshida, HMizushina, Y Pinophilins A and B, inhibitors of mammalian A-, B-, and Y-family DNA polymerases and human cancer cell proliferation. J Nat Prod 75:135-41 (2012)  
Target
Name:
DNA polymerase lambda
Synonyms:
DNA polymerase lambda (Pol λ) POLL
Type:
Protein
Mol. Mass.:
63493.10
Organism:
Homo sapiens (Human)
Description:
Residue:
575
  
Inhibitor
Name:
BDBM50379294
Synonyms:
CHEMBL2011647
Type:
Small organic molecule
Emp. Form.:
C21H22O8
Mol. Mass.:
402.3946
SMILES:
Cc1cc(O)cc(O)c1C(=O)O[C@H]1[C@@H]2COC(\C=C\CO)=CC2=CC(=O)[C@@]1(C)O
: