Target
Serine/threonine-protein kinase haspin
Ligand
BDBM50379521
Substrate
Meas. Tech.
ChEMBL_812377 (CHEMBL2014113)
IC50
100±n/a nM
Citation
 Cuny, GDUlyanova, NPPatnaik, DLiu, JFLin, XAuerbach, KRay, SSXian, JGlicksman, MAStein, RLHiggins, JM Structure-activity relationship study of beta-carboline derivatives as haspin kinase inhibitors. Bioorg Med Chem Lett 22:2015-9 (2012)  
Target
Name:
Serine/threonine-protein kinase haspin
Synonyms:
GSG2 H-haspin HASP_HUMAN | Haploid germ cell-specific nuclear protein kinase
Type:
PROTEIN
Mol. Mass.:
88531.28
Organism:
Homo sapiens (Human)
Description:
ChEMBL_1510616
Residue:
798
  
Inhibitor
Name:
BDBM50379521
Synonyms:
CHEMBL2012574
Type:
Small organic molecule
Emp. Form.:
C17H18F3N3O
Mol. Mass.:
337.3395
SMILES:
COc1ccc2c(c1)n(CCCCN)c1c(nccc21)C(F)(F)F
: