Target
Neuropeptide Y receptor type 5
Ligand
BDBM50353148
Substrate
Meas. Tech.
ChEMBL_811654 (CHEMBL2014167)
Ki
0.3±n/a nM
Citation
 Wu, LLu, KPackiarajan, MJubian, VChandrasena, GWolinsky, TCWalker, MW Indolyl and dihydroindolyl N-glycinamides as potent and in vivo active NPY5 antagonists. Bioorg Med Chem Lett 22:2167-71 (2012)  
Target
Name:
Neuropeptide Y receptor type 5
Synonyms:
NPY-Y5 NPY5-R NPY5R_HUMAN NPYY5 Neuropeptide Y receptor type 5 ( NPY Y5) | Y5 receptor
Type:
Enzyme
Mol. Mass.:
50746.64
Organism:
Homo sapiens (Human)
Description:
Q15761
Residue:
445
  
Inhibitor
Name:
BDBM50353148
Synonyms:
CHEMBL1829320
Type:
Small organic molecule
Emp. Form.:
C20H28ClN3O5S
Mol. Mass.:
457.971
SMILES:
CC(C)S(=O)(=O)NC[C@H]1CC[C@@H](CC1)NC(=O)CN1C(=O)COc2cc(Cl)ccc12
: