Target
1-deoxy-D-xylulose 5-phosphate reductoisomerase
Ligand
BDBM50379999
Substrate
Meas. Tech.
ChEMBL_810561 (CHEMBL2015311)
IC50
1480±n/a nM
Citation
 Ponaire, SZinglé, CTritsch, DGrosdemange-Billiard, CRohmer, M Growth inhibition of Mycobacterium smegmatis by prodrugs of deoxyxylulose phosphate reducto-isomerase inhibitors, promising anti-mycobacterial agents. Eur J Med Chem 51:277-85 (2012)  
Target
Name:
1-deoxy-D-xylulose 5-phosphate reductoisomerase
Synonyms:
2-C-methyl-D-erythritol 4-phosphate synthase DXR_MYCS2 | dxr
Type:
PROTEIN
Mol. Mass.:
41046.78
Organism:
Mycobacterium smegmatis (strain ATCC 700084 / mc(2)155)
Description:
ChEMBL_810561
Residue:
398
  
Inhibitor
Name:
BDBM50379999
Synonyms:
CHEMBL1161784
Type:
Small organic molecule
Emp. Form.:
C4H10NO5P
Mol. Mass.:
183.0997
SMILES:
ONC(=O)CCCP(O)(O)=O
: