Target
Cytochrome P450 2C19
Ligand
BDBM50380524
Substrate
Meas. Tech.
ChEMBL_813096 (CHEMBL2020670)
Ki
1000±n/a nM
Citation
 Foti, RSRock, DAHan, XFlowers, RAWienkers, LCWahlstrom, JL Ligand-based design of a potent and selective inhibitor of cytochrome P450 2C19. J Med Chem 55:1205-14 (2012)  
Target
Name:
Cytochrome P450 2C19
Synonyms:
CP2CJ_HUMAN CYPIIC17 Cytochrome P450 2C19 (CYP2C19) Mephenytoin 4-hydroxylase P450-254C
Type:
Enzyme
Mol. Mass.:
55935.47
Organism:
Homo sapiens (Human)
Description:
P33261
Residue:
490
  
Inhibitor
Name:
BDBM50380524
Synonyms:
CHEMBL2018910
Type:
Small organic molecule
Emp. Form.:
C13H18N2OS
Mol. Mass.:
250.36
SMILES:
COc1ccc2nc(SCC(C)(C)C)[nH]c2c1
: