Target
Vasopressin V1a receptor
Ligand
BDBM50380758
Substrate
Meas. Tech.
ChEMBL_813471 (CHEMBL2019479)
Ki
790±n/a nM
Citation
 Smith, ALFreeman, SMStehouwer, JSInoue, KVoll, RJYoung, LJGoodman, MM Synthesis and evaluation of C-11, F-18 and I-125 small molecule radioligands for detecting oxytocin receptors. Bioorg Med Chem 20:2721-38 (2012)  
Target
Name:
Vasopressin V1a receptor
Synonyms:
AVPR V1a AVPR1A V1AR_HUMAN VASOPRESSIN V1A Vasopressin V1 receptor Vasopressin receptor
Type:
Receptor
Mol. Mass.:
46820.18
Organism:
Homo sapiens (Human)
Description:
P37288
Residue:
418
  
Inhibitor
Name:
BDBM50380758
Synonyms:
CHEMBL2017867
Type:
Small organic molecule
Emp. Form.:
C31H38IN3O6S
Mol. Mass.:
707.619
SMILES:
CS(=O)(=O)N1CCC(CC1)Oc1ccc(CC(=O)N2CCC(CC2)N2C(=O)CCc3ccccc23)c(OC\C=C\I)c1
: