Target
C-C chemokine receptor type 4
Ligand
BDBM50380867
Substrate
Meas. Tech.
ChEMBL_812670 (CHEMBL2019171)
Ki
12.59±n/a nM
Citation
 Procopiou, PAFord, AJGraves, RHHall, DAHodgson, STLacroix, YMNeedham, DSlack, RJ Lead optimisation of the N1 substituent of a novel series of indazole arylsulfonamides as CCR4 antagonists and identification of a candidate for clinical investigation. Bioorg Med Chem Lett 22:2730-3 (2012)  
Target
Name:
C-C chemokine receptor type 4
Synonyms:
C-C CKR-4 C-C chemokine receptor type 4 (CCR4) CCR-4 CCR4_HUMAN CMKBR4 | K5-5
Type:
Enzyme
Mol. Mass.:
41406.41
Organism:
Homo sapiens (Human)
Description:
P51679
Residue:
360
  
Inhibitor
Name:
BDBM50380867
Synonyms:
CHEMBL2018964
Type:
Small organic molecule
Emp. Form.:
C22H21ClN4O4S2
Mol. Mass.:
505.01
SMILES:
COc1cccc2n(Cc3cccc(CNC(C)=O)c3)nc(NS(=O)(=O)c3ccc(Cl)s3)c12
: