Target
Cholesteryl ester transfer protein
Ligand
BDBM50312718
Substrate
Meas. Tech.
ChEMBL_814571 (CHEMBL2021090)
IC50
39±n/a nM
Citation
 Fernandez, MCEscribano, AMateo, AIParthasarathy, SMartin de la Nava, EMWang, XCockerham, SLBeyer, TPSchmidt, RJCao, GZhang, YJones, TMBorel, ASweetana, SACannady, EAStephenson, GFrank, SMantlo, NB Design, synthesis and structure-activity-relationship of 1,5-tetrahydronaphthyridines as CETP inhibitors. Bioorg Med Chem Lett 22:3056-62 (2012)  
Target
Name:
Cholesteryl ester transfer protein
Synonyms:
CETP Cholesteryl ester transfer protein (CETP) | Lipid transfer protein I
Type:
Enzyme
Mol. Mass.:
54751.53
Organism:
Homo sapiens (Human)
Description:
P11597
Residue:
493
  
Inhibitor
Name:
BDBM50312718
Synonyms:
CHEMBL479527 | torcetrapib
Type:
Small organic molecule
Emp. Form.:
C26H25F9N2O4
Mol. Mass.:
600.4733
SMILES:
CCOC(=O)N1[C@H](CC)C[C@H](N(Cc2cc(cc(c2)C(F)(F)F)C(F)(F)F)C(=O)OC)c2cc(ccc12)C(F)(F)F
: