Target
Serine/threonine-protein kinase pim-1
Ligand
BDBM50383267
Substrate
Meas. Tech.
ChEMBL_819566 (CHEMBL2033650)
IC50
6000±n/a nM
Citation
 Good, ACLiu, JHirth, BAsmussen, GXiang, YBiemann, HPBishop, KAFremgen, TFitzgerald, MGladysheva, TJain, AJancsics, KMetz, MPapoulis, ASkerlj, RStepp, JDWei, RR Implications of promiscuous Pim-1 kinase fragment inhibitor hydrophobic interactions for fragment-based drug design. J Med Chem 55:2641-8 (2012)  
Target
Name:
Serine/threonine-protein kinase pim-1
Synonyms:
PIM-1 Kinase PIM1_HUMAN Serine/threonine-protein kinase (PIM1) Serine/threonine-protein kinase PIM1 | Serine/threonine-protein kinase pim-1 (PIM1)
Type:
Protein
Mol. Mass.:
35681.82
Organism:
Homo sapiens (Human)
Description:
P11309
Residue:
313
  
Inhibitor
Name:
BDBM50383267
Synonyms:
CHEMBL2032370
Type:
Small organic molecule
Emp. Form.:
C10H5NO2
Mol. Mass.:
171.1522
SMILES:
O=C1C(C#N)C(=O)c2ccccc12
: