Target
Serine/threonine-protein kinase pim-1
Ligand
BDBM50383270
Substrate
Meas. Tech.
ChEMBL_819566 (CHEMBL2033650)
IC50
28000±n/a nM
Citation
 Good, ACLiu, JHirth, BAsmussen, GXiang, YBiemann, HPBishop, KAFremgen, TFitzgerald, MGladysheva, TJain, AJancsics, KMetz, MPapoulis, ASkerlj, RStepp, JDWei, RR Implications of promiscuous Pim-1 kinase fragment inhibitor hydrophobic interactions for fragment-based drug design. J Med Chem 55:2641-8 (2012)  
Target
Name:
Serine/threonine-protein kinase pim-1
Synonyms:
PIM-1 Kinase PIM1_HUMAN Serine/threonine-protein kinase (PIM1) Serine/threonine-protein kinase PIM1 | Serine/threonine-protein kinase pim-1 (PIM1)
Type:
Protein
Mol. Mass.:
35681.82
Organism:
Homo sapiens (Human)
Description:
P11309
Residue:
313
  
Inhibitor
Name:
BDBM50383270
Synonyms:
CHEMBL2032373
Type:
Small organic molecule
Emp. Form.:
C13H9NO2
Mol. Mass.:
211.2161
SMILES:
O=C(c1ccco1)c1c[nH]c2ccccc12
: