Target
Alpha-2C adrenergic receptor
Ligand
BDBM50384293
Substrate
Meas. Tech.
ChEMBL_820274 (CHEMBL2033361)
Ki
862±n/a nM
Citation
 Banister, SDRendina, LMKassiou, M 7-Azabicyclo[2.2.1]heptane as a scaffold for the development of selective sigma-2 (s2) receptor ligands. Bioorg Med Chem Lett 22:4059-63 (2012)  
Target
Name:
Alpha-2C adrenergic receptor
Synonyms:
ADA2C_HUMAN ADRA2L2 Adrenergic alpha2C Adrenergic receptor alpha Alpha-2 adrenergic receptor subtype C4 Alpha-2C adrenoreceptor | adrenergic, alpha-2C-, receptor [Homo sapiens]
Type:
Enzyme
Mol. Mass.:
49552.32
Organism:
Homo sapiens (Human)
Description:
P18825
Residue:
462
  
Inhibitor
Name:
BDBM50384293
Synonyms:
CHEMBL2030634
Type:
Small organic molecule
Emp. Form.:
C11H21N
Mol. Mass.:
167.2911
SMILES:
C(C1CCCCC1)N1CCCC1
: