Target
Cytochrome P450 2C19
Ligand
BDBM50384443
Substrate
Meas. Tech.
ChEMBL_821758 (CHEMBL2039055)
IC50
>50118.72±n/a nM
Citation
 Jin, JMorales-Ramos, AEidam, PMecom, JLi, YBrooks, CHilfiker, MZhang, DWang, NShi, DTseng, PSWheless, KBudzik, BEvans, KJaworski, JPJugus, JLeon, LWu, CPullen, MKaramshi, BRao, PWard, ELaping, NEvans, CLeach, CHolt, DSu, XMorrow, DFries, HThorneloe, KEdwards, R Novel 3-Oxazolidinedione-6-aryl-pyridinones as Potent, Selective, and Orally Active EP3 Receptor Antagonists. ACS Med Chem Lett 1:316-320 (2010)  
Target
Name:
Cytochrome P450 2C19
Synonyms:
CP2CJ_HUMAN CYPIIC17 Cytochrome P450 2C19 (CYP2C19) Mephenytoin 4-hydroxylase P450-254C
Type:
Enzyme
Mol. Mass.:
55935.47
Organism:
Homo sapiens (Human)
Description:
P33261
Residue:
490
  
Inhibitor
Name:
BDBM50384443
Synonyms:
CHEMBL1770317
Type:
Small organic molecule
Emp. Form.:
C21H18N2O4
Mol. Mass.:
362.3786
SMILES:
CC(C)C1(OC(O)=NC1=O)c1ccc([nH]c1=O)-c1ccc2ccccc2c1
: