Target
Prostaglandin E2 receptor EP3 subtype
Ligand
BDBM50384442
Substrate
Meas. Tech.
ChEMBL_821761 (CHEMBL2039058)
Ki
316.23±n/a nM
Citation
 Jin, JMorales-Ramos, AEidam, PMecom, JLi, YBrooks, CHilfiker, MZhang, DWang, NShi, DTseng, PSWheless, KBudzik, BEvans, KJaworski, JPJugus, JLeon, LWu, CPullen, MKaramshi, BRao, PWard, ELaping, NEvans, CLeach, CHolt, DSu, XMorrow, DFries, HThorneloe, KEdwards, R Novel 3-Oxazolidinedione-6-aryl-pyridinones as Potent, Selective, and Orally Active EP3 Receptor Antagonists. ACS Med Chem Lett 1:316-320 (2010)  
Target
Name:
Prostaglandin E2 receptor EP3 subtype
Synonyms:
PE2R3_RAT Prostaglandin E2 Prostanoid EP3 receptor | Ptger3
Type:
Enzyme Catalytic Domain
Mol. Mass.:
39958.37
Organism:
RAT
Description:
Prostaglandin E2 PTGER2 RAT::P34980
Residue:
365
  
Inhibitor
Name:
BDBM50384442
Synonyms:
CHEMBL2035507
Type:
Small organic molecule
Emp. Form.:
C18H12N2O4
Mol. Mass.:
320.2989
SMILES:
Oc1[nH]c(=O)oc1-c1ccc([nH]c1=O)-c1ccc2ccccc2c1
: