Target
Prolyl hydroxylase EGLN3
Ligand
BDBM50385788
Substrate
Meas. Tech.
ChEMBL_823545 (CHEMBL2045988)
IC50
1.6±n/a nM
Citation
 Vachal, PMiao, SPierce, JMGuiadeen, DColandrea, VJWyvratt, MJSalowe, SPSonatore, LMMilligan, JAHajdu, RGollapudi, AKeohane, CALingham, RBMandala, SMDeMartino, JATong, XWolff, MSteinhuebel, DKieczykowski, GRFleitz, FJChapman, KAthanasopoulos, JAdam, GAkyuz, CDJena, DKLusen, JWMeng, JStein, BDXia, LSherer, ECHale, JJ 1,3,8-Triazaspiro[4.5]decane-2,4-diones as efficacious pan-inhibitors of hypoxia-inducible factor prolyl hydroxylase 1-3 (HIF PHD1-3) for the treatment of anemia. J Med Chem 55:2945-59 (2012)  
Target
Name:
Prolyl hydroxylase EGLN3
Synonyms:
EGLN3 Egl nine homolog 3 (EGLIN3) | Egl nine homolog 3 (EGLN3)
Type:
Protein
Mol. Mass.:
27265.54
Organism:
Homo sapiens (Human)
Description:
Q9H6Z9
Residue:
239
  
Inhibitor
Name:
BDBM50385788
Synonyms:
CHEMBL2041175
Type:
Small organic molecule
Emp. Form.:
C31H27N7O3S
Mol. Mass.:
577.656
SMILES:
Cc1cccnc1CN1CCC2(CC1)N(C(=O)N(C2=O)c1ccc(cc1)-c1ccc2scnc2c1)c1cc(=O)[nH]cn1
: