Target
Prolyl hydroxylase EGLN3
Ligand
BDBM50385825
Substrate
Meas. Tech.
ChEMBL_823545 (CHEMBL2045988)
IC50
5.9±n/a nM
Citation
 Vachal, PMiao, SPierce, JMGuiadeen, DColandrea, VJWyvratt, MJSalowe, SPSonatore, LMMilligan, JAHajdu, RGollapudi, AKeohane, CALingham, RBMandala, SMDeMartino, JATong, XWolff, MSteinhuebel, DKieczykowski, GRFleitz, FJChapman, KAthanasopoulos, JAdam, GAkyuz, CDJena, DKLusen, JWMeng, JStein, BDXia, LSherer, ECHale, JJ 1,3,8-Triazaspiro[4.5]decane-2,4-diones as efficacious pan-inhibitors of hypoxia-inducible factor prolyl hydroxylase 1-3 (HIF PHD1-3) for the treatment of anemia. J Med Chem 55:2945-59 (2012)  
Target
Name:
Prolyl hydroxylase EGLN3
Synonyms:
EGLN3 Egl nine homolog 3 (EGLIN3) | Egl nine homolog 3 (EGLN3)
Type:
Protein
Mol. Mass.:
27265.54
Organism:
Homo sapiens (Human)
Description:
Q9H6Z9
Residue:
239
  
Inhibitor
Name:
BDBM50385825
Synonyms:
CHEMBL2040897
Type:
Small organic molecule
Emp. Form.:
C29H29N7O3S
Mol. Mass.:
555.651
SMILES:
Cc1nc(C)c(s1)-c1ccc(cc1)N1C(=O)N(c2cc(=O)[nH]cn2)C2(CCN(Cc3ncccc3C)CC2)C1=O
: