Target
Squalene synthase
Ligand
BDBM50388354
Substrate
Meas. Tech.
ChEMBL_829805 (CHEMBL2061324)
IC50
220±n/a nM
Citation
 Ichikawa, MOhtsuka, MOhki, HHaginoya, NItoh, MSugita, KUsui, HSuzuki, MTerayama, KKanda, A Discovery of novel tricyclic compounds as squalene synthase inhibitors. Bioorg Med Chem 20:3072-93 (2012)  
Target
Name:
Squalene synthase
Synonyms:
FDFT_RAT Farnesyl-diphosphate farnesyltransferase SQS Squalene synthetase
Type:
PROTEIN
Mol. Mass.:
48109.41
Organism:
Rattus norvegicus
Description:
ChEMBL_1336736
Residue:
416
  
Inhibitor
Name:
BDBM50388354
Synonyms:
CHEMBL2057270
Type:
Small organic molecule
Emp. Form.:
C23H22ClNO5
Mol. Mass.:
427.877
SMILES:
COC(=O)CC1OC(c2cccc(OC)c2OC)c2cc(Cl)ccc2-n2cccc12
: