Target
Squalene synthase
Ligand
BDBM50388377
Substrate
Meas. Tech.
ChEMBL_829805 (CHEMBL2061324)
IC50
0.81±n/a nM
Citation
 Ichikawa, MOhtsuka, MOhki, HHaginoya, NItoh, MSugita, KUsui, HSuzuki, MTerayama, KKanda, A Discovery of novel tricyclic compounds as squalene synthase inhibitors. Bioorg Med Chem 20:3072-93 (2012)  
Target
Name:
Squalene synthase
Synonyms:
FDFT_RAT Farnesyl-diphosphate farnesyltransferase SQS Squalene synthetase
Type:
PROTEIN
Mol. Mass.:
48109.41
Organism:
Rattus norvegicus
Description:
ChEMBL_1336736
Residue:
416
  
Inhibitor
Name:
BDBM50388377
Synonyms:
CHEMBL2057638
Type:
Small organic molecule
Emp. Form.:
C26H25ClN4O5
Mol. Mass.:
508.954
SMILES:
COc1cccc([C@H]2O[C@H](CCn3nncc3CC(O)=O)c3cccn3-c3ccc(Cl)cc23)c1OC
: