Target
Squalene synthase
Ligand
BDBM50388381
Substrate
Meas. Tech.
ChEMBL_829805 (CHEMBL2061324)
IC50
1.6±n/a nM
Citation
 Ichikawa, MOhtsuka, MOhki, HHaginoya, NItoh, MSugita, KUsui, HSuzuki, MTerayama, KKanda, A Discovery of novel tricyclic compounds as squalene synthase inhibitors. Bioorg Med Chem 20:3072-93 (2012)  
Target
Name:
Squalene synthase
Synonyms:
FDFT_RAT Farnesyl-diphosphate farnesyltransferase SQS Squalene synthetase
Type:
PROTEIN
Mol. Mass.:
48109.41
Organism:
Rattus norvegicus
Description:
ChEMBL_1336736
Residue:
416
  
Inhibitor
Name:
BDBM50388381
Synonyms:
CHEMBL2057955
Type:
Small organic molecule
Emp. Form.:
C27H26ClN3O5
Mol. Mass.:
507.965
SMILES:
COc1cccc([C@H]2O[C@H](CCn3nccc3CC(O)=O)c3cccn3-c3ccc(Cl)cc23)c1OC
: