Target
Squalene synthase
Ligand
BDBM50388387
Substrate
Meas. Tech.
ChEMBL_829805 (CHEMBL2061324)
IC50
0.85±n/a nM
Citation
 Ichikawa, MOhtsuka, MOhki, HHaginoya, NItoh, MSugita, KUsui, HSuzuki, MTerayama, KKanda, A Discovery of novel tricyclic compounds as squalene synthase inhibitors. Bioorg Med Chem 20:3072-93 (2012)  
Target
Name:
Squalene synthase
Synonyms:
FDFT_RAT Farnesyl-diphosphate farnesyltransferase SQS Squalene synthetase
Type:
PROTEIN
Mol. Mass.:
48109.41
Organism:
Rattus norvegicus
Description:
ChEMBL_1336736
Residue:
416
  
Inhibitor
Name:
BDBM50388387
Synonyms:
CHEMBL2057961
Type:
Small organic molecule
Emp. Form.:
C26H26ClN5O5
Mol. Mass.:
523.968
SMILES:
COc1cccc([C@H]2O[C@H](CCn3nnc(CCC(O)=O)n3)c3cccn3-c3ccc(Cl)cc23)c1OC
: