Target
Melanin-concentrating hormone receptor 1
Ligand
BDBM50388459
Substrate
Meas. Tech.
ChEMBL_829933 (CHEMBL2061638)
IC50
5.3±n/a nM
Citation
 Kasai, SKamata, MMasada, SKunitomo, JKamaura, MOkawa, TTakami, KOgino, HNakano, YAshina, SWatanabe, KKaisho, TImai, YNRyu, SNakayama, MNagisa, YTakekawa, SKato, KMurata, TSuzuki, NIshihara, Y Synthesis, structure-activity relationship, and pharmacological studies of novel melanin-concentrating hormone receptor 1 antagonists 3-aminomethylquinolines: reducing human ether-a-go-go-related gene (hERG) associated liabilities. J Med Chem 55:4336-51 (2012)  
Target
Name:
Melanin-concentrating hormone receptor 1
Synonyms:
G-protein coupled receptor 24 MCH receptor 1 MCH-R1 MCHR-1 MCHR1_HUMAN Melanin-Concentrating Hormone Receptor 1 (MCH1R) Melanin-concentrating hormone receptor 1 (MCH-1) Melanin-concentrating hormone receptor 1 (MCHR-1) SLC-1 Somatostatin receptor-like protein
Type:
G Protein-Coupled Receptor (GPCR)
Mol. Mass.:
45976.27
Organism:
Homo sapiens (Human)
Description:
Membranes from CHO-K1 cells stably expressing human MCH1R were used in assays.
Residue:
422
  
Inhibitor
Name:
BDBM50388459
Synonyms:
CHEMBL2059512
Type:
Small organic molecule
Emp. Form.:
C27H32N4O3
Mol. Mass.:
460.568
SMILES:
C[C@H](NCCNC(C)=O)c1cnc2c(C)c(NC(=O)c3ccc(OCC4CC4)cc3)ccc2c1
: