Target
M-phase inducer phosphatase 2
Ligand
BDBM26617
Substrate
Meas. Tech.
ChEMBL_830418 (CHEMBL2061096)
Ki
5300±n/a nM
Citation
 Lavecchia, ADi Giovanni, CPesapane, AMontuori, NRagno, PMartucci, NMMasullo, MDe Vendittis, ENovellino, E Discovery of new inhibitors of Cdc25B dual specificity phosphatases by structure-based virtual screening. J Med Chem 55:4142-58 (2012)  
Target
Name:
M-phase inducer phosphatase 2
Synonyms:
CDC25B Dual specificity phosphatase (CDC25B) M-phase inducer phosphatase 2 (CDC25B) | MPIP2_HUMAN
Type:
Protein
Mol. Mass.:
64985.27
Organism:
Homo sapiens (Human)
Description:
Residue:
580
  
Inhibitor
Name:
BDBM26617
Synonyms:
4-[(2-carboxyphenyl)carbonyl]benzene-1,2-dicarboxylic acid | Compound 28620
Type:
Small organic molecule
Emp. Form.:
C16H10O7
Mol. Mass.:
314.2464
SMILES:
OC(=O)c1ccccc1C(=O)c1ccc(C(O)=O)c(c1)C(O)=O
: