Target
M-phase inducer phosphatase 2
Ligand
BDBM41999
Substrate
Meas. Tech.
ChEMBL_830418 (CHEMBL2061096)
Ki
80±n/a nM
Citation
 Lavecchia, ADi Giovanni, CPesapane, AMontuori, NRagno, PMartucci, NMMasullo, MDe Vendittis, ENovellino, E Discovery of new inhibitors of Cdc25B dual specificity phosphatases by structure-based virtual screening. J Med Chem 55:4142-58 (2012)  
Target
Name:
M-phase inducer phosphatase 2
Synonyms:
CDC25B Dual specificity phosphatase (CDC25B) M-phase inducer phosphatase 2 (CDC25B) | MPIP2_HUMAN
Type:
Protein
Mol. Mass.:
64985.27
Organism:
Homo sapiens (Human)
Description:
Residue:
580
  
Inhibitor
Name:
BDBM41999
Synonyms:
3-(3,4,5-trihydroxy-6-keto-xanthen-9-yl)propionic acid 3-(3,4,5-trihydroxy-6-oxoxanthen-9-yl)propanoic acid MLS-0111617.0001 | cid_274127
Type:
Small organic molecule
Emp. Form.:
C16H12O7
Mol. Mass.:
316.2623
SMILES:
OC(=O)CCc1c2ccc(O)c(O)c2oc2c(O)c(=O)ccc12
: