Target
M-phase inducer phosphatase 1
Ligand
BDBM26617
Substrate
Meas. Tech.
ChEMBL_830416 (CHEMBL2061094)
IC50
6000±n/a nM
Citation
 Lavecchia, ADi Giovanni, CPesapane, AMontuori, NRagno, PMartucci, NMMasullo, MDe Vendittis, ENovellino, E Discovery of new inhibitors of Cdc25B dual specificity phosphatases by structure-based virtual screening. J Med Chem 55:4142-58 (2012)  
Target
Name:
M-phase inducer phosphatase 1
Synonyms:
CDC25A Dual specificity phosphatase Cdc25A MPIP1_HUMAN | phosphatase Cdc25
Type:
Protein
Mol. Mass.:
59090.18
Organism:
Homo sapiens (Human)
Description:
P30304
Residue:
524
  
Inhibitor
Name:
BDBM26617
Synonyms:
4-[(2-carboxyphenyl)carbonyl]benzene-1,2-dicarboxylic acid | Compound 28620
Type:
Small organic molecule
Emp. Form.:
C16H10O7
Mol. Mass.:
314.2464
SMILES:
OC(=O)c1ccccc1C(=O)c1ccc(C(O)=O)c(c1)C(O)=O
: