Target
M-phase inducer phosphatase 2
Ligand
BDBM50388541
Substrate
Meas. Tech.
ChEMBL_830415 (CHEMBL2061093)
IC50
23800±n/a nM
Citation
 Lavecchia, ADi Giovanni, CPesapane, AMontuori, NRagno, PMartucci, NMMasullo, MDe Vendittis, ENovellino, E Discovery of new inhibitors of Cdc25B dual specificity phosphatases by structure-based virtual screening. J Med Chem 55:4142-58 (2012)  
Target
Name:
M-phase inducer phosphatase 2
Synonyms:
CDC25B Dual specificity phosphatase (CDC25B) M-phase inducer phosphatase 2 (CDC25B) | MPIP2_HUMAN
Type:
Protein
Mol. Mass.:
64985.27
Organism:
Homo sapiens (Human)
Description:
Residue:
580
  
Inhibitor
Name:
BDBM50388541
Synonyms:
CHEMBL1370674
Type:
Small organic molecule
Emp. Form.:
C15H14N2O4
Mol. Mass.:
286.2827
SMILES:
Nc1ccc(Cc2ccc(N)c(c2)C(O)=O)cc1C(O)=O
: