Target
Lysine--tRNA ligase
Ligand
BDBM50390549
Substrate
Meas. Tech.
ChEMBL_835320 (CHEMBL2072026)
IC50
200±n/a nM
Citation
 Castillo, MForns, PErra, MMir, MLópez, MMaldonado, MOrellana, ACarreño, CRamis, IMiralpeix, MVidal, B Highly potent aminopyridines as Syk kinase inhibitors. Bioorg Med Chem Lett 22:5419-23 (2012)  
Target
Name:
Lysine--tRNA ligase
Synonyms:
KARS KIAA0070 SYK_HUMAN
Type:
PROTEIN
Mol. Mass.:
68044.78
Organism:
Homo sapiens (Human)
Description:
ChEMBL_960665
Residue:
597
  
Inhibitor
Name:
BDBM50390549
Synonyms:
CHEMBL2069336
Type:
Small organic molecule
Emp. Form.:
C18H20N6
Mol. Mass.:
320.3916
SMILES:
Cc1ccnc(Nc2cccc(n2)-c2ccnc(NCCN)c2)c1
: