Target
Lysine--tRNA ligase
Ligand
BDBM50390573
Substrate
Meas. Tech.
ChEMBL_835320 (CHEMBL2072026)
IC50
9±n/a nM
Citation
 Castillo, MForns, PErra, MMir, MLópez, MMaldonado, MOrellana, ACarreño, CRamis, IMiralpeix, MVidal, B Highly potent aminopyridines as Syk kinase inhibitors. Bioorg Med Chem Lett 22:5419-23 (2012)  
Target
Name:
Lysine--tRNA ligase
Synonyms:
KARS KIAA0070 SYK_HUMAN
Type:
PROTEIN
Mol. Mass.:
68044.78
Organism:
Homo sapiens (Human)
Description:
ChEMBL_960665
Residue:
597
  
Inhibitor
Name:
BDBM50390573
Synonyms:
CHEMBL2069356
Type:
Small organic molecule
Emp. Form.:
C23H22N10O
Mol. Mass.:
454.4872
SMILES:
O=C(Nc1cc(Nc2cnccn2)nc(c1)-c1ccnc(c1)N1CCNCC1)c1cncnc1
: