Target
Probable G-protein coupled receptor 142
Ligand
BDBM50390603
Substrate
Meas. Tech.
ChEMBL_835424 (CHEMBL2072130)
EC50
1900±n/a nM
Citation
 Lizarzaburu, MTurcotte, SDu, XDuquette, JFu, AHouze, JLi, LLiu, JMurakoshi, MOda, KOkuyama, RNara, FReagan, JYu, MMedina, JC Discovery and optimization of a novel series of GPR142 agonists for the treatment of type 2 diabetes mellitus. Bioorg Med Chem Lett 22:5942-7 (2012)  
Target
Name:
Probable G-protein coupled receptor 142
Synonyms:
G-protein coupled receptor PGR2 GPR142 | PGR2
Type:
PROTEIN
Mol. Mass.:
51127.50
Organism:
Homo sapiens (Human)
Description:
ChEMBL_985961
Residue:
462
  
Inhibitor
Name:
BDBM50390603
Synonyms:
CHEMBL2069583
Type:
Small organic molecule
Emp. Form.:
C23H23N5OS
Mol. Mass.:
417.527
SMILES:
Cn1ccc(n1)-c1cccc(NC(=O)[C@H](Cc2ccccc2)NCc2cscn2)c1
: