Target
Cytochrome P450 2D6
Ligand
BDBM50390599
Substrate
Meas. Tech.
ChEMBL_835434 (CHEMBL2072140)
IC50
>30000±n/a nM
Citation
 Lizarzaburu, MTurcotte, SDu, XDuquette, JFu, AHouze, JLi, LLiu, JMurakoshi, MOda, KOkuyama, RNara, FReagan, JYu, MMedina, JC Discovery and optimization of a novel series of GPR142 agonists for the treatment of type 2 diabetes mellitus. Bioorg Med Chem Lett 22:5942-7 (2012)  
Target
Name:
Cytochrome P450 2D6
Synonyms:
CP2D6_HUMAN CYP2DL1 Cytochrome P450 2D6 (CYP2D6) P450-DB1
Type:
Protein
Mol. Mass.:
55774.82
Organism:
Homo sapiens (Human)
Description:
P10635
Residue:
497
  
Inhibitor
Name:
BDBM50390599
Synonyms:
CHEMBL2069579
Type:
Small organic molecule
Emp. Form.:
C25H22N4O3S
Mol. Mass.:
458.532
SMILES:
OC(=O)c1cc(NC(=O)[C@H](Cc2ccccc2)NCc2cscn2)cc(c1)-c1ccncc1
: