Target
Carbonic anhydrase 12
Ligand
BDBM50390685
Substrate
Meas. Tech.
ChEMBL_835657 (CHEMBL2071768)
Ki
6960±n/a nM
Citation
 Sechi, MInnocenti, APala, NRogolino, DCarcelli, MScozzafava, ASupuran, CT Inhibition ofa-class cytosolic human carbonic anhydrases I, II, IX and XII, andß-class fungal enzymes by carboxylic acids and their derivatives: new isoform-I selective nanomolar inhibitors. Bioorg Med Chem Lett 22:5801-6 (2012)  
Target
Name:
Carbonic anhydrase 12
Synonyms:
CA-XII CAH12_HUMAN Carbonic anhydrase Carbonic anhydrase XII Carbonic anhydrase XII (CAXII) | Tumor antigen HOM-RCC-3.1.3
Type:
Enzyme
Mol. Mass.:
39456.00
Organism:
Homo sapiens (Human)
Description:
Catalytic domain of human cloned isozyme was used in the assay
Residue:
354
  
Inhibitor
Name:
BDBM50390685
Synonyms:
CHEMBL2070211
Type:
Small organic molecule
Emp. Form.:
C11H9NO4
Mol. Mass.:
219.1935
SMILES:
COC(=O)C(=O)C1C(=O)Nc2ccccc12
: