Target
Oxysterols receptor LXR-beta
Ligand
BDBM50390752
Substrate
Meas. Tech.
ChEMBL_835704 (CHEMBL2071815)
IC50
2800±n/a nM
Citation
 Jiao, XKopecky, DJFisher, BPiper, DELabelle, MMcKendry, SHarrison, MJones, SJaen, JShiau, AKEscaron, PDanao, JChai, ACoward, PKayser, F Discovery and optimization of a series of liver X receptor antagonists. Bioorg Med Chem Lett 22:5966-70 (2012)  
Target
Name:
Oxysterols receptor LXR-beta
Synonyms:
LXRB Liver X, LXR beta NR1H2 Nuclear receptor NER Ubiquitously-expressed nuclear receptor
Type:
Enzyme Catalytic Domain
Mol. Mass.:
50978.79
Organism:
Homo sapiens (Human)
Description:
P55055
Residue:
460
  
Inhibitor
Name:
BDBM50390752
Synonyms:
CHEMBL2069319
Type:
Small organic molecule
Emp. Form.:
C27H25F3N2O5S
Mol. Mass.:
546.558
SMILES:
CC(C)CN(c1ccc(cc1)C(O)(C#Cc1ccc(cc1C)[N+]([O-])=O)C(F)(F)F)S(=O)(=O)c1ccccc1
: