Target
Oxysterols receptor LXR-beta
Ligand
BDBM50390759
Substrate
Meas. Tech.
ChEMBL_835704 (CHEMBL2071815)
IC50
4300±n/a nM
Citation
 Jiao, XKopecky, DJFisher, BPiper, DELabelle, MMcKendry, SHarrison, MJones, SJaen, JShiau, AKEscaron, PDanao, JChai, ACoward, PKayser, F Discovery and optimization of a series of liver X receptor antagonists. Bioorg Med Chem Lett 22:5966-70 (2012)  
Target
Name:
Oxysterols receptor LXR-beta
Synonyms:
LXRB Liver X, LXR beta NR1H2 Nuclear receptor NER Ubiquitously-expressed nuclear receptor
Type:
Enzyme Catalytic Domain
Mol. Mass.:
50978.79
Organism:
Homo sapiens (Human)
Description:
P55055
Residue:
460
  
Inhibitor
Name:
BDBM50390759
Synonyms:
CHEMBL2070457
Type:
Small organic molecule
Emp. Form.:
C28H22F6N2O5S2
Mol. Mass.:
644.605
SMILES:
CC(C)CN(c1ccc(cc1)C(O)(C#Cc1ccc(cc1)S(=O)(=O)C(F)(F)F)C(F)(F)F)S(=O)(=O)c1cccc(c1)C#N
: