Target
Oxysterols receptor LXR-beta
Ligand
BDBM50390734
Substrate
Meas. Tech.
ChEMBL_835704 (CHEMBL2071815)
IC50
1100±n/a nM
Citation
 Jiao, XKopecky, DJFisher, BPiper, DELabelle, MMcKendry, SHarrison, MJones, SJaen, JShiau, AKEscaron, PDanao, JChai, ACoward, PKayser, F Discovery and optimization of a series of liver X receptor antagonists. Bioorg Med Chem Lett 22:5966-70 (2012)  
Target
Name:
Oxysterols receptor LXR-beta
Synonyms:
LXRB Liver X, LXR beta NR1H2 Nuclear receptor NER Ubiquitously-expressed nuclear receptor
Type:
Enzyme Catalytic Domain
Mol. Mass.:
50978.79
Organism:
Homo sapiens (Human)
Description:
P55055
Residue:
460
  
Inhibitor
Name:
BDBM50390734
Synonyms:
CHEMBL2070357
Type:
Small organic molecule
Emp. Form.:
C24H28F3NO3S
Mol. Mass.:
467.544
SMILES:
CC(C)CN(c1ccc(cc1)C(O)(C#CC(C)(C)C)C(F)(F)F)S(=O)(=O)c1ccccc1
: