Target
Oxysterols receptor LXR-beta
Ligand
BDBM50390764
Substrate
Meas. Tech.
ChEMBL_835705 (CHEMBL2071816)
IC50
4000±n/a nM
Citation
 Jiao, XKopecky, DJFisher, BPiper, DELabelle, MMcKendry, SHarrison, MJones, SJaen, JShiau, AKEscaron, PDanao, JChai, ACoward, PKayser, F Discovery and optimization of a series of liver X receptor antagonists. Bioorg Med Chem Lett 22:5966-70 (2012)  
Target
Name:
Oxysterols receptor LXR-beta
Synonyms:
LXRB Liver X, LXR beta NR1H2 Nuclear receptor NER Ubiquitously-expressed nuclear receptor
Type:
Enzyme Catalytic Domain
Mol. Mass.:
50978.79
Organism:
Homo sapiens (Human)
Description:
P55055
Residue:
460
  
Inhibitor
Name:
BDBM50390764
Synonyms:
CHEMBL2070462
Type:
Small organic molecule
Emp. Form.:
C26H21F6NO5S2
Mol. Mass.:
605.569
SMILES:
CS(=O)(=O)c1ccc(cc1)C#CC(O)(c1ccc(cc1)N(CCC(F)(F)F)S(=O)(=O)c1ccccc1)C(F)(F)F
: