Target
Mitogen-activated protein kinase 14
Ligand
BDBM50390772
Substrate
Meas. Tech.
ChEMBL_835729 (CHEMBL2071840)
IC50
590±n/a nM
Citation
 He, LSeitz, SPTrainor, GLTortolani, DVaccaro, WPoss, MTarby, CMTokarski, JSPenhallow, BHung, CYAttar, RLin, TA Modulation of cofilin phosphorylation by inhibition of the Lim family kinases. Bioorg Med Chem Lett 22:5995-8 (2012)  
Target
Name:
Mitogen-activated protein kinase 14
Synonyms:
CSAID-binding protein CSBP1 CSPB1 MAP kinase 14 MAP kinase p38 alpha MAPK14 MK14_HUMAN Mitogen-activated protein kinase p38 alpha Stress-activated protein kinase 2a | p38 MAP kinase alpha/beta
Type:
Serine/threonine-protein kinase
Mol. Mass.:
41286.76
Organism:
Homo sapiens (Human)
Description:
Q16539
Residue:
360
  
Inhibitor
Name:
BDBM50390772
Synonyms:
CHEMBL2070490
Type:
Small organic molecule
Emp. Form.:
C24H22ClFN4OS
Mol. Mass.:
468.974
SMILES:
CCOc1ccc(c(Cl)c1)-c1cc(nc(n1)-c1ccccc1F)-c1cnc(NC(C)C)s1
: