Target
LIM domain kinase 2
Ligand
BDBM50390784
Substrate
Meas. Tech.
ChEMBL_835730 (CHEMBL2071841)
IC50
171±n/a nM
Citation
 He, LSeitz, SPTrainor, GLTortolani, DVaccaro, WPoss, MTarby, CMTokarski, JSPenhallow, BHung, CYAttar, RLin, TA Modulation of cofilin phosphorylation by inhibition of the Lim family kinases. Bioorg Med Chem Lett 22:5995-8 (2012)  
Target
Name:
LIM domain kinase 2
Synonyms:
LIMK2 | LIMK2_HUMAN
Type:
PROTEIN
Mol. Mass.:
72238.81
Organism:
Homo sapiens (Human)
Description:
ChEMBL_1514398
Residue:
638
  
Inhibitor
Name:
BDBM50390784
Synonyms:
CHEMBL2070503
Type:
Small organic molecule
Emp. Form.:
C23H23ClN6OS
Mol. Mass.:
466.986
SMILES:
CCCNc1ncc(s1)-c1cc(nc(n1)-c1cnccn1)-c1cc(OCCC)ccc1Cl
: