Target
Dual specificity testis-specific protein kinase 1
Ligand
BDBM50390791
Substrate
Meas. Tech.
ChEMBL_835731 (CHEMBL2071842)
IC50
455±n/a nM
Citation
 He, LSeitz, SPTrainor, GLTortolani, DVaccaro, WPoss, MTarby, CMTokarski, JSPenhallow, BHung, CYAttar, RLin, TA Modulation of cofilin phosphorylation by inhibition of the Lim family kinases. Bioorg Med Chem Lett 22:5995-8 (2012)  
Target
Name:
Dual specificity testis-specific protein kinase 1
Synonyms:
TESK1 | TESK1_HUMAN
Type:
PROTEIN
Mol. Mass.:
67696.22
Organism:
Homo sapiens (Human)
Description:
ChEMBL_587103
Residue:
626
  
Inhibitor
Name:
BDBM50390791
Synonyms:
CHEMBL2070615
Type:
Small organic molecule
Emp. Form.:
C23H23N7O2S
Mol. Mass.:
461.539
SMILES:
CCNC(=O)Nc1ncc(s1)-c1cc(nc(n1)-c1cnccn1)-c1c(C)cc(OC)cc1C
: