Target
Translocator protein
Ligand
BDBM50390841
Substrate
Meas. Tech.
ChEMBL_835804 (CHEMBL2071915)
Ki
0.05±n/a nM
Citation
 Wadsworth, HJones, PAChau, WFDurrant, CMorisson-Iveson, VPassmore, JO'Shea, DWynn, DKhan, IBlack, AAvory, MTrigg, W Exploration of the structure-activity relationship of the diaryl anilide class of ligands for translocator protein--potential novel positron emitting tomography imaging agents. Bioorg Med Chem Lett 22:5795-800 (2012)  
Target
Name:
Translocator protein
Synonyms:
Benzodiazepine receptors; peripheral & central Mbr PBR Peripheral benzodiazepine receptor (PBR) TSPO_RAT | Tspo
Type:
Mitochondrion membrane protein
Mol. Mass.:
18945.84
Organism:
Rattus norvegicus (rat)
Description:
Competitive binding experiments were performed on rat kidney mitochondrial membranes.
Residue:
169
  
Inhibitor
Name:
BDBM50390841
Synonyms:
CHEMBL2070787
Type:
Small organic molecule
Emp. Form.:
C22H21FN2O3
Mol. Mass.:
380.4121
SMILES:
CC(=O)N(Cc1cccc(OCCF)c1)c1cnccc1Oc1ccccc1
: