Target
ATP-dependent translocase ABCB1
Ligand
BDBM50390991
Substrate
Meas. Tech.
ChEMBL_838282 (CHEMBL2076230)
Ki
115500±n/a nM
Citation
 Ekins, SKim, RBLeake, BFDantzig, AHSchuetz, EGLan, LBYasuda, KShepard, RLWinter, MASchuetz, JDWikel, JHWrighton, SA Three-dimensional quantitative structure-activity relationships of inhibitors of P-glycoprotein. Mol Pharmacol 61:964-73 (2002)  
Target
Name:
ATP-dependent translocase ABCB1
Synonyms:
ABCB1 MDR1_HUMAN Multidrug resistance protein 1 P-glycoprotein (P-gp) PGY1
Type:
Protein
Mol. Mass.:
141503.50
Organism:
Homo sapiens (Human)
Description:
P08183
Residue:
1280
  
Inhibitor
Name:
BDBM50390991
Synonyms:
ERGONOVINE
Type:
Small organic molecule
Emp. Form.:
C19H23N3O2
Mol. Mass.:
325.4048
SMILES:
C[C@@H](CO)NC(=O)[C@H]1CN(C)[C@@H]2Cc3c[nH]c4cccc(C2=C1)c34
: