Target
Replicase polyprotein 1a
Ligand
BDBM50391429
Substrate
Meas. Tech.
ChEMBL_848935 (CHEMBL2149729)
IC50
52000±n/a nM
Citation
 Park, JYKim, JHKim, YMJeong, HJKim, DWPark, KHKwon, HJPark, SJLee, WSRyu, YB Tanshinones as selective and slow-binding inhibitors for SARS-CoV cysteine proteases. Bioorg Med Chem 20:5928-35 (2012)  
Target
Name:
Replicase polyprotein 1a
Synonyms:
3C-like proteinase 3CLp Growth factor-like peptide Non-structural protein 1 Non-structural protein 11 Non-structural protein 3 Non-structural protein 6 Non-structural protein 8 ORF1a polyprotein PL2-PRO Papain-like proteinase Replicase polyprotein 1a SARS coronavirus 3C-like proteinase nsp1 nsp11 nsp3 nsp5 nsp7 nsp9 pp1a
Type:
Enzyme
Mol. Mass.:
486353.36
Organism:
Human SARS coronavirus (SARS-CoV)
Description:
P0C6U8
Residue:
4382
  
Inhibitor
Name:
BDBM50391429
Synonyms:
CHEMBL215254 | acs.jmedchem.1c00409_ST.620
Type:
Small organic molecule
Emp. Form.:
C19H18O4
Mol. Mass.:
310.3438
SMILES:
Cc1coc-2c1C(=O)C(=O)c1c3CCCC(C)(CO)c3ccc-21
: