Target
Polyunsaturated fatty acid 5-lipoxygenase
Ligand
BDBM50391884
Substrate
Meas. Tech.
ChEMBL_849364 (CHEMBL2149156)
IC50
>50000±n/a nM
Citation
 Baumgartner, LSosa, SAtanasov, AGBodensieck, AFakhrudin, NBauer, JFavero, GDPonti, CHeiss, EHSchwaiger, SLadurner, AWidowitz, ULoggia, RDRollinger, JMWerz, OBauer, RDirsch, VMTubaro, AStuppner, H Lignan derivatives from Krameria lappacea roots inhibit acute inflammation in vivo and pro-inflammatory mediators in vitro. J Nat Prod 74:1779-86 (2011)  
Target
Name:
Polyunsaturated fatty acid 5-lipoxygenase
Synonyms:
5-LO 5-Lipoxygenase (5-LO) 5-Lipoygenase ALOX5 LOG5 | LOX5_HUMAN
Type:
Enzyme
Mol. Mass.:
77972.74
Organism:
Homo sapiens (Human)
Description:
Recombinant protein was purified from E. coli lysate. After ammonium sulfate precipitation and subsequent steps, the supernatant (S100) was used for 5-LO activity assay.
Residue:
674
  
Inhibitor
Name:
BDBM50391884
Synonyms:
CHEMBL463574
Type:
Small organic molecule
Emp. Form.:
C18H16O2
Mol. Mass.:
264.3184
SMILES:
C\C=C\c1ccc2oc(c(C)c2c1)-c1ccc(O)cc1
: