Target
5-hydroxytryptamine receptor 7
Ligand
BDBM50253281
Substrate
Meas. Tech.
ChEMBL_855538 (CHEMBL2162843)
Ki
0.58±n/a nM
Citation
 Zajdel, PKurczab, RGrychowska, KSatala, GPawlowski, MBojarski, AJ The multiobjective based design, synthesis and evaluation of the arylsulfonamide/amide derivatives of aryloxyethyl- and arylthioethyl- piperidines and pyrrolidines as a novel class of potent 5-HT7 receptor antagonists. Eur J Med Chem 56:348-360 (2012)  
Target
Name:
5-hydroxytryptamine receptor 7
Synonyms:
5-HT-7 5-HT7 5-HT7S 5HT7 HTR7 | Serotonin receptor 7
Type:
G Protein-Coupled Receptor (GPCR)
Mol. Mass.:
53573.08
Organism:
Homo sapiens (Human)
Description:
P34969
Residue:
479
  
Inhibitor
Name:
BDBM50253281
Synonyms:
CHEMBL522691 | N-(4-Cyanophenylmethyl)-4-(2-diphenyl)-1-piperazinehexanamide
Type:
Small organic molecule
Emp. Form.:
C30H34N4O
Mol. Mass.:
466.6172
SMILES:
O=C(CCCCCN1CCN(CC1)c1ccccc1-c1ccccc1)NCc1ccc(cc1)C#N
: