Target
Glucagon-like peptide 1 receptor
Ligand
BDBM50393579
Substrate
Meas. Tech.
ChEMBL_855309 (CHEMBL2161793)
EC50
>20000±n/a nM
Citation
 Liu, QLi, NYuan, YLu, HWu, XZhou, CHe, MSu, HZhang, MWang, JWang, BWang, YMa, DYe, YWeiss, HCGesing, ERLiao, JWang, MW Cyclobutane derivatives as novel nonpeptidic small molecule agonists of glucagon-like peptide-1 receptor. J Med Chem 55:250-67 (2012)  
Target
Name:
Glucagon-like peptide 1 receptor
Synonyms:
GLP1R_RAT Glpr
Type:
PROTEIN
Mol. Mass.:
52889.73
Organism:
Rattus norvegicus
Description:
ChEMBL_855307
Residue:
463
  
Inhibitor
Name:
BDBM50393579
Synonyms:
CHEMBL2158415
Type:
Small organic molecule
Emp. Form.:
C28H28N2O8S
Mol. Mass.:
552.596
SMILES:
COc1cc(ccc1OC(=O)c1cccs1)[C@H]1C[C@]1(NC(=O)c1ccc(NC(=O)OC(C)(C)C)cc1)C(O)=O
: