Target
ATP-sensitive inward rectifier potassium channel 11
Ligand
BDBM50357204
Substrate
Meas. Tech.
ChEMBL_857216 (CHEMBL2160412)
IC50
>5000±n/a nM
Citation
 Lowes, DPradhan, AIyer, LVParman, TGow, JZhu, FFurimsky, ALemoff, AGuiguemde, WASigal, MClark, JAWilson, ETang, LConnelly, MCDerisi, JLKyle, DEMirsalis, JGuy, RK Lead optimization of antimalarial propafenone analogues. J Med Chem 55:6087-93 (2012)  
Target
Name:
ATP-sensitive inward rectifier potassium channel 11
Synonyms:
ATP-sensitive inward rectifier potassium channel 11 Inward rectifier K(+) channel Kir6.2 KCNJ11 Potassium channel, inwardly rectifying, subfamily J, member 11 Sulfonylurea receptor 2, Kir6.2
Type:
Enzyme Catalytic Domain
Mol. Mass.:
43549.41
Organism:
Homo sapiens (Human)
Description:
Potassium channel (ATP modulatory) 0 0::Q14654
Residue:
390
  
Inhibitor
Name:
BDBM50357204
Synonyms:
CHEMBL1914835 | CHEMBL1963280
Type:
Small organic molecule
Emp. Form.:
C29H33NO3
Mol. Mass.:
443.5772
SMILES:
OC(COc1ccccc1C(=O)CCc1ccccc1)CN1CCC(CC1)c1ccccc1
: