Target
ATP-sensitive inward rectifier potassium channel 11
Ligand
BDBM50357205
Substrate
Meas. Tech.
ChEMBL_857216 (CHEMBL2160412)
IC50
>5000±n/a nM
Citation
 Lowes, DPradhan, AIyer, LVParman, TGow, JZhu, FFurimsky, ALemoff, AGuiguemde, WASigal, MClark, JAWilson, ETang, LConnelly, MCDerisi, JLKyle, DEMirsalis, JGuy, RK Lead optimization of antimalarial propafenone analogues. J Med Chem 55:6087-93 (2012)  
Target
Name:
ATP-sensitive inward rectifier potassium channel 11
Synonyms:
ATP-sensitive inward rectifier potassium channel 11 Inward rectifier K(+) channel Kir6.2 KCNJ11 Potassium channel, inwardly rectifying, subfamily J, member 11 Sulfonylurea receptor 2, Kir6.2
Type:
Enzyme Catalytic Domain
Mol. Mass.:
43549.41
Organism:
Homo sapiens (Human)
Description:
Potassium channel (ATP modulatory) 0 0::Q14654
Residue:
390
  
Inhibitor
Name:
BDBM50357205
Synonyms:
CHEMBL1914844 | CHEMBL1963594
Type:
Small organic molecule
Emp. Form.:
C29H34N2O3
Mol. Mass.:
458.5919
SMILES:
Cc1ccc(cc1)N1CCN(CC(O)COc2ccccc2C(=O)CCc2ccccc2)CC1
: