Target
Smoothened homolog
Ligand
BDBM50394397
Substrate
Meas. Tech.
ChEMBL_854593 (CHEMBL2161254)
IC50
11±n/a nM
Citation
 Cheng, DHan, DGao, WJing, QJiang, JWan, YEnglund, NPTuntland, TWu, XPan, S Design, synthesis, and structure-activity-relationship of phenyl imidazoles as potent Smoothened antagonists. Bioorg Med Chem Lett 22:6573-6 (2012)  
Target
Name:
Smoothened homolog
Synonyms:
SMO_MOUSE Smoh
Type:
PROTEIN
Mol. Mass.:
87472.73
Organism:
Mus musculus
Description:
ChEMBL_1510377
Residue:
793
  
Inhibitor
Name:
BDBM50394397
Synonyms:
CHEMBL2160067
Type:
Small organic molecule
Emp. Form.:
C28H25ClN6O
Mol. Mass.:
496.991
SMILES:
C[C@@H]1CN(CCO1)c1ccc2c(Nc3ccc(Cl)c(c3)-c3nc(c[nH]3)-c3ccccc3)nccc2n1
: