Target
Smoothened homolog
Ligand
BDBM50249522
Substrate
Meas. Tech.
ChEMBL_856172 (CHEMBL2162708)
IC50
1.5±n/a nM
Citation
 Wang, JMook, RALu, JGooden, DMRibeiro, AGuo, ABarak, LSLyerly, HKChen, W Identification of a novel Smoothened antagonist that potently suppresses Hedgehog signaling. Bioorg Med Chem 20:6751-7 (2012)  
Target
Name:
Smoothened homolog
Synonyms:
SMO_MOUSE Smoh
Type:
PROTEIN
Mol. Mass.:
87472.73
Organism:
Mus musculus
Description:
ChEMBL_1510377
Residue:
793
  
Inhibitor
Name:
BDBM50249522
Synonyms:
2-chloro-N-(4-chloro-3-(pyridin-2-yl)phenyl)-4-(methylsulfonyl)benzamide VISMODEGIB
Type:
Small organic molecule
Emp. Form.:
C19H14Cl2N2O3S
Mol. Mass.:
421.297
SMILES:
CS(=O)(=O)c1ccc(C(=O)Nc2ccc(Cl)c(c2)-c2ccccn2)c(Cl)c1
: