Target
Smoothened homolog
Ligand
BDBM50394562
Substrate
Meas. Tech.
ChEMBL_856169 (CHEMBL2162705)
Ki
6±n/a nM
Citation
 Wang, JMook, RALu, JGooden, DMRibeiro, AGuo, ABarak, LSLyerly, HKChen, W Identification of a novel Smoothened antagonist that potently suppresses Hedgehog signaling. Bioorg Med Chem 20:6751-7 (2012)  
Target
Name:
Smoothened homolog
Synonyms:
G-protein- coupled-like receptor Smoothened (Smo) SMOH Smoothened homolog
Type:
Protein
Mol. Mass.:
86415.51
Organism:
Homo sapiens (Human)
Description:
Q99835
Residue:
787
  
Inhibitor
Name:
BDBM50394562
Synonyms:
ERISMODEGIB N-(6-((2S,6R)-2,6-dimethylmorpholino)pyridin-3-yl)-2-methyl-4'-(trifluoromethoxy)biphenyl-3-carboxamide sonidegib | sonidegib phosphate
Type:
Small organic molecule
Emp. Form.:
C26H26F3N3O3
Mol. Mass.:
485.4981
SMILES:
C[C@H]1CN(C[C@@H](C)O1)c1ccc(NC(=O)c2cccc(c2C)-c2ccc(OC(F)(F)F)cc2)cn1
: