Target
Fatty-acid amide hydrolase 1 [30-579]
Ligand
BDBM50394625
Substrate
Meas. Tech.
ChEMBL_857857 (CHEMBL2169490)
IC50
75±n/a nM
Citation
 Keith, JMApodaca, RTichenor, MXiao, WJones, WPierce, JSeierstad, MPalmer, JWebb, MKarbarz, MScott, BWilson, SLuo, LWennerholm, MChang, LBrown, SRizzolio, MRynberg, RChaplan, SBreitenbucher, JG Aryl Piperazinyl Ureas as Inhibitors of Fatty Acid Amide Hydrolase (FAAH) in Rat, Dog, and Primate. ACS Med Chem Lett 3:823-827 (2012)  
Target
Name:
Fatty-acid amide hydrolase 1 [30-579]
Synonyms:
Anandamide amidohydrolase 1 Faah Fatty Acid Amide Hydrolase Fatty-acid amide hydrolase (FAAH) Fatty-acid amide hydrolase 1 (FAAH) Oleamide hydrolase 1
Type:
Single-pass membrane protein; homodimer
Mol. Mass.:
60474.00
Organism:
Rattus norvegicus (rat)
Description:
P97612 (aa 30-579)
Residue:
550
  
Inhibitor
Name:
BDBM50394625
Synonyms:
CHEMBL2164600 | US9169224, 63
Type:
Small organic molecule
Emp. Form.:
C28H33N3O2
Mol. Mass.:
443.5805
SMILES:
CC(C)(C)c1ccc(Oc2cccc(CN3CCN(CC3)C(=O)Nc3ccccc3)c2)cc1
: